BDBM50005056 5,7-Dichloro-4-(2-oxo-pyrrolidin-1-yl)-1,2,3,4-tetrahydro-quinoline-2-carboxylic acid::CHEMBL302427
SMILES OC(=O)[C@H]1C[C@H](N2CCCC2=O)c2c(Cl)cc(Cl)cc2N1
InChI Key InChIKey=HVVGVECEQTYTJB-MNOVXSKESA-N
Data  1 IC50
  Tab Delimited (TSV)   2D SDfile   Computed 3D by Vconf -m prep SDfile
Find this compound or compounds like it in BindingDB:
Activity Spreadsheet -- Enzyme Inhibition Constant Data from BindingDB
Found 1 hit for monomerid = 50005056
TargetGlutamate receptor ionotropic, NMDA 1(RAT)
Merck Sharp and Dohme Research Laboratories
Curated by ChEMBL
LigandPNGBDBM50005056(5,7-Dichloro-4-(2-oxo-pyrrolidin-1-yl)-1,2,3,4-tet...)
Affinity DataIC50:  46nM. Assay description: Inhibition of [3H]- glycine binding to NMDA receptor from rat cortical membranes.
In DepthDetails ArticlePubMed